{"text_format":"3","workbook":"xlsx","n_sheets":12,"sheets":["Portada","Usuarios","Abogados","Registro Casos","Judiciales","Arbitramentos","Comité de conciliación","Pagos","Resumen","Información a consolidar","Administrador","Entidades"],"not_rendered":{"images":5,"external_links":1,"defined_names":1},"read":"whole","date_system":"1900"}

{"sheet":"Portada","index":0,"n_rows":22,"n_cols":35,"rows_kept":22,"merged":[[1,4,2,21],[5,1,5,2],[5,4,5,7],[5,8,5,9],[6,1,6,2],[7,1,7,2],[8,1,8,2],[8,4,10,21],[9,1,9,2],[10,1,10,2],[11,1,11,2],[12,1,12,2],[13,1,13,2],[13,6,18,7],[13,11,18,12],[13,13,18,14],[13,18,18,19],[13,20,18,21],[14,1,14,2],[15,1,15,2],[16,1,16,2],[17,1,17,2],[18,1,18,2],[19,1,19,2],[20,1,20,2],[21,1,21,2],[21,4,23,18],[21,19,22,21],[23,19,23,21]]}
[]
[{"$nulls":4},"Plantilla del Certificado de Control Interno ekOGUI"]
[]
[{"$nulls":34},"I - 2025"]
[{"$nulls":34},"II - 2025"]
[null,"Portada",null,null,"Periodo a diligenciar",{"$nulls":3},"I - 2025",{"$nulls":25},"I - 2026"]
[{"$nulls":34},"II - 2026"]
[null,"Usuarios"]
[{"$nulls":4},"Por favor seleccione la información que desea registrar, en cualquier momento puede visualizar los resultados de la información que haya registrado seleccionando la opción de Resumen (certificación a presentar)."]
[null,"Abogados"]
[]
[null,"Registro Casos"]
[{"$nulls":4}," "]
[null,"Judiciales",{"$nulls":4},"Utilice la barra de navegación lateral izquierda para moverse entre pestañas",{"$nulls":6},"Utilice las listas desplegables para llenar información a lo largo del documento",{"$nulls":6},"Utilice la información del lateral derecho como ayuda de llenado de la pestaña"]
[]
{"$rows_left_out":8}
{"sheet":"Usuarios","index":1,"n_rows":24,"n_cols":20,"rows_kept":24,"merged":[[1,4,2,21],[4,4,5,16],[4,19,10,21],[5,1,5,2],[6,1,6,2],[7,1,7,2],[7,4,8,6],[7,7,8,9],[7,10,8,13],[7,14,8,16],[8,1,8,2],[9,1,9,2],[10,1,10,2],[10,4,11,6],[10,7,11,9],[10,10,11,13],[10,14,11,16],[11,1,11,2],[11,19,12,21],[12,1,12,2],[12,4,13,6],[12,7,13,9],[12,10,13,13],[12,14,13,16],[13,1,13,2],[13,19,13,21],[14,1,14,2],[14,4,15,6],[14,7,15,9],[14,10,15,13],[14,14,15,16],[15,1,15,2],[15,19,32,21],[16,1,16,2],[16,4,17,6],[16,7,17,9],[16,10,17,13],[16,14,17,16],[17,1,17,2],[18,1,18,2],[18,4,19,6],[18,7,19,9],[18,10,19,13],[18,14,19,16],[19,1,19,2],[20,1,20,2],[21,1,21,2],[21,4,22,16],[23,4,32,16]]}
[]
[{"$nulls":4},"Usuarios"]
[]
[]
[{"$nulls":4},"En esta sección se presenta la información detallada de los usuarios activos en el sistema.",{"$nulls":14},"Para saber más sobre cómo completar la hoja de usuarios puede consultar la sección (Hoja de usuarios) de la Guía de Control Interno."]
[null,"Portada"]
[]
[null,"Usuarios",null,null,"Rol",null,null,"Fecha creación en ekOGUI (DD/MM/AAAA)",null,null,"Nombres y Apellidos",{"$nulls":3},"Fecha última capacitación (DD/MM/AAAA)"]
[]
[null,"Abogados"]
[{"$nulls":4},"Jefe Financiero",null,null,"2021-03-18",null,null,"Tayro Alberto Pimienta Deluque",{"$nulls":3},"2025-01-22"]
[null,"Registro Casos",{"$nulls":15},{"$f":"IFERROR(LOOKUP(O11,Administrador!$H$9:$H$11,Administrador!$I$9:$I$11),0)","v":2},{"$f":"IF(R12=0,1,\"\")","v":""},"Acceder a la guía"]
[{"$nulls":4},"Jefe Jurídico",null,null,"2023-06-07",null,null,"Paola Fontalvo Lopez",{"$nulls":3},"2025-01-22"]
[null,"Judiciales",{"$nulls":15},{"$f":"IFERROR(LOOKUP(O13,Administrador!$H$9:$H$11,Administrador!$I$9:$I$11),0)","v":2},{"$f":"IF(R14=0,1,\"\")","v":""}]
[{"$nulls":4},"Jefe de Control Interno",null,null,"2015-04-03",null,null,"Jose Antonio Cardozo Alvarez",{"$nulls":3},"2025-01-22"]
{"$rows_left_out":10}
{"sheet":"Abogados","index":2,"n_rows":27,"n_cols":19,"rows_kept":27,"merged":[[1,4,2,21],[4,4,5,16],[4,18,10,20],[5,1,5,2],[6,1,6,2],[7,1,7,2],[8,1,8,2],[8,6,10,7],[8,9,10,10],[8,12,10,13],[8,15,10,16],[9,1,9,2],[10,1,10,2],[11,1,11,2],[11,6,13,7],[11,9,13,10],[11,12,13,13],[11,15,13,16],[11,18,12,21],[12,1,12,2],[13,1,13,2],[13,18,13,21],[14,1,14,2],[15,1,15,2],[15,18,32,21],[16,1,16,2],[16,4,17,9],[16,11,17,16],[17,1,17,2],[18,1,18,2],[18,4,19,7],[18,8,19,9],[18,11,19,14],[18,15,19,16],[19,1,19,2],[20,1,20,2],[20,4,21,7],[20,8,21,9],[20,11,21,14],[20,15,21,16],[21,1,21,2],[22,4,23,7],[22,8,23,9],[22,11,23,14],[22,15,23,16],[25,4,25,16],[26,4,32,16]]}
[]
[{"$nulls":4},"Abogados"]
[]
[]
[{"$nulls":4},"En esta sección se presenta la información detallada de los abogados.",{"$nulls":13},"Para saber más sobre cómo completar la hoja de abogados puede consultar la sección (Hoja de abogados) de la Guía de Control Interno."]
[null,"Portada"]
[]
[null,"Usuarios"]
[{"$nulls":6},8,null,null,8,null,null,1,null,null,1]
[null,"Abogados"]
[]
[null,"Registro Casos",{"$nulls":4},"Cantidad de abogados litigando según jurídica al 30 de junio de 2025",null,null,"Abogados activos en ekOGUI al 30 de junio de 2025",null,null,"Retirados de la entidad según jurídica durante el primer semestre de 2025",null,null,"Inactivados en ekOGUI durante el primer semestre de 2025",null,null,"Acceder a la guía"]
[]
[null,"Judiciales"]
[{"$nulls":7},{"$f":"+J9*25%","v":2},{"$f":"+INT(IF(J9<10,J9,IF(H15<10,10,H15)))","v":8}]
{"$rows_left_out":13}
{"sheet":"Registro Casos","index":3,"n_rows":23,"n_cols":20,"rows_kept":23,"merged":[[1,4,2,21],[3,4,3,21],[5,1,5,2],[5,4,6,17],[5,19,12,21],[6,1,6,2],[7,1,7,2],[8,1,8,2],[9,1,9,2],[9,6,10,14],[9,15,10,15],[10,1,10,2],[11,1,11,2],[12,1,12,2],[12,6,13,14],[12,15,13,15],[13,1,13,2],[13,19,14,21],[14,1,14,2],[15,1,15,2],[15,6,16,14],[15,15,16,15],[16,1,16,2],[17,1,17,2],[17,19,25,21],[18,1,18,2],[18,6,19,14],[18,15,19,15],[19,1,19,2],[20,1,20,2],[21,1,21,2],[21,4,21,17],[22,4,25,17]]}
[]
[{"$nulls":4},"Registro Casos en ekOGUI"]
[]
[]
[]
[null,"Portada",null,null,"En esta sección se presenta la información detallada de los casos recibidos y registrados en ekOGUI. ",{"$nulls":14},"Para saber más sobre cómo completar la hoja de Registro Casos en ekOGUI puede consultar la sección (Hoja Registro Casos) de la Guía de Control Interno"]
[]
[null,"Usuarios"]
[]
[null,"Abogados",{"$nulls":4},{"$f":"\"Cuántos autos admisorios de procesos judiciales fueron notificados por el buzón notificaciones judiciales a la Entidad durante el semestre \"&Portada!I6","v":"Cuántos autos admisorios de procesos judiciales fueron notificados por el buzón notificaciones judiciales a la Entidad durante el semestre I - 2025"},{"$nulls":8},2]
[]
[null,"Registro Casos"]
[{"$nulls":6},"De acuerdo con la pregunta anterior, cuántos de los autos admisorios de procesos judiciales notificados fueron registrados en el sistema ekOGUI durante el semestre I - 2025",{"$nulls":8},2]
[null,"Judiciales",{"$nulls":17},"Acceder a la guía"]
[]
{"$rows_left_out":9}
{"sheet":"Judiciales","index":4,"n_rows":45,"n_cols":23,"rows_kept":45,"merged":[[2,4,3,24],[5,1,5,2],[5,4,6,20],[5,22,12,24],[6,1,6,2],[7,1,7,2],[8,1,8,2],[9,1,9,2],[9,4,10,10],[9,11,10,11],[9,13,10,19],[9,20,10,20],[10,1,10,2],[11,1,11,2],[11,4,12,10],[11,11,12,11],[11,13,12,19],[11,20,12,20],[12,1,12,2],[13,1,13,2],[13,4,14,10],[13,11,14,11],[13,12,14,12],[13,13,14,19],[13,20,14,20],[13,22,14,24],[14,1,14,2],[15,1,15,2],[15,4,16,10],[15,11,16,11],[15,13,16,19],[15,20,16,20],[16,1,16,2],[17,1,17,2],[17,22,50,24],[18,1,18,2],[18,4,19,10],[18,11,19,11],[18,13,19,19],[18,20,19,20],[19,1,19,2],[20,1,20,2],[20,4,21,10],[20,11,21,11],[20,13,21,19],[20,20,21,20],[21,1,21,2],[21,12,22,12],[22,4,23,10],[22,11,23,11],[22,13,23,19],[22,20,23,20],[24,13,25,19],[24,20,25,20],[25,4,27,11],[26,13,27,19],[26,20,27,20],[28,19,28,20],[29,4,30,10],[29,11,30,11],[29,13,30,17],[29,18,30,18],[29,19,30,20],[31,4,32,10],[31,11,32,11],[31,13,32,17],[31,18,32,18],[31,19,32,20],[33,4,34,10],[33,11,34,11],[33,13,34,17],[33,18,34,18],[33,19,34,20],[35,4,36,10],[35,11,36,11],[35,13,36,17],[35,18,36,18],[35,19,36,20],[37,4,38,10],[37,11,38,11],[37,13,38,17],[37,18,38,18],[37,19,38,20],[39,4,40,10],[39,11,40,11],[43,4,43,20],[44,4,50,20]]}
[]
[]
[{"$nulls":4},"Judiciales"]
[]
[]
[null,"Portada",null,null,"En esta sección se presenta la información detallada de los procesos judiciales.",{"$nulls":17},"Para saber más sobre cómo completar la hoja de procesos judiciales puede consultar la sección (Hoja Judiciales) de la Guía de Control Interno"]
[]
[null,"Usuarios"]
[]
[null,"Abogados",null,null,{"$f":"\"Procesos activos al \"&Administrador!B5&\"DE \"&Administrador!B4","v":"Procesos activos al 30 DE JUNIO DE 2025"},{"$nulls":6},"Cantidad",null,"Mayores a 33.0000 SMMLV activos",{"$nulls":6},"Cantidad"]
[]
[null,"Registro Casos",null,null,"Cantidad de procesos activos según jurídica",{"$nulls":6},101,null,"Cantidad de procesos de más de 33.000 SMMLV según jurídica",{"$nulls":6},3]
[]
[null,"Judiciales",null,null,"Cantidad de procesos activos registrados en ekOGUI",{"$nulls":6},93,null,"Cantidad de procesos de más de 33.000 SMMLV registrados en ekOGUI",{"$nulls":6},3,null,"Acceder a la guía"]
[]
{"$rows_left_out":31}
{"sheet":"Arbitramentos","index":5,"n_rows":22,"n_cols":23,"rows_kept":22,"merged":[[1,4,2,24],[4,4,5,20],[4,22,10,24],[5,1,5,2],[6,1,6,2],[7,1,7,2],[8,1,8,2],[8,4,9,10],[8,11,9,11],[8,13,9,19],[8,20,9,20],[9,1,9,2],[10,1,10,2],[10,4,11,10],[10,11,11,11],[10,13,11,19],[10,20,11,20],[11,1,11,2],[11,22,12,24],[12,1,12,2],[12,4,13,10],[12,11,13,11],[12,13,13,19],[12,20,13,20],[13,1,13,2],[14,1,14,2],[15,1,15,2],[16,1,16,2],[16,4,16,20],[17,1,17,2],[17,4,20,20],[18,1,18,2],[19,1,19,2],[20,1,20,2],[21,1,21,2]]}
[]
[{"$nulls":4},"Arbitramentos"]
[]
[]
[{"$nulls":4},"En esta sección se presenta la información detallada de los procesos de arbitramentos.",{"$nulls":17},"Para saber más sobre cómo completar la hoja de arbitramentos puede consultar la sección (Hoja de Arbitramentos) de la Guía de Control Interno."]
[null,"Portada"]
[]
[null,"Usuarios"]
[{"$nulls":4},"Arbitramentos",{"$nulls":6},"Cantidad",null,"Arbitramentos",{"$nulls":6},"Cantidad"]
[null,"Abogados"]
[{"$nulls":4},{"$f":"\"Total de arbitramentos activos al \"&Administrador!B5&\"de \"&Administrador!B4&\" según jurídica\"","v":"Total de arbitramentos activos al 30 DE JUNIO de 2025 según jurídica"},{"$nulls":6},0,null,{"$f":"\"Total arbitramentos terminados al \"&Administrador!B5&\"de \"&Administrador!B4&\" según jurídica\"","v":"Total arbitramentos terminados al 30 DE JUNIO de 2025 según jurídica"},{"$nulls":6},0]
[null,"Registro Casos",{"$nulls":20},"Acceder a la guía"]
[{"$nulls":4},"Total de arbitramentos activos registrados en ekOGUI al 30 de junio de 2025",{"$nulls":6},0,null,"Total de arbitramentos terminados en ekOGUI al 30 de junio de 2025",{"$nulls":6},0]
[null,"Judiciales"]
[]
{"$rows_left_out":8}
{"sheet":"Comité de conciliación","index":6,"n_rows":25,"n_cols":20,"rows_kept":25,"merged":[[0,4,2,21],[4,4,5,17],[4,19,11,21],[5,1,5,2],[6,1,6,2],[7,1,7,2],[7,4,8,16],[7,17,8,17],[8,1,8,2],[9,1,9,2],[9,4,10,16],[9,17,10,17],[10,1,10,2],[11,1,11,2],[12,1,12,2],[12,4,12,14],[12,19,13,21],[13,1,13,2],[13,4,13,8],[13,9,13,10],[13,11,13,12],[13,13,13,14],[14,1,14,2],[14,4,14,8],[14,9,14,10],[14,11,14,12],[14,13,14,14],[15,1,15,2],[15,4,15,8],[15,9,15,10],[15,11,15,12],[15,13,15,14],[16,1,16,2],[16,4,16,8],[16,9,16,10],[16,11,16,12],[16,13,16,14],[17,1,17,2],[18,1,18,2],[18,4,18,8],[18,9,18,10],[19,1,19,2],[19,4,19,8],[19,9,19,10],[20,1,20,2],[20,4,20,8],[20,9,20,10],[21,1,21,2],[21,4,21,8],[21,9,21,10],[23,4,23,17],[24,4,29,17]]}
[{"$nulls":4},"Comité de Conciliación"]
[]
[]
[]
[{"$nulls":4},"En esta sección se presenta la información detallada de los comités de conciliación.",{"$nulls":14},"Para saber más sobre cómo completar la hoja de Comités de Conciliación puede consultar la sección (Hoja Comités de Conciliación) de la Guía de Control Interno"]
[null,"Portada"]
[]
[null,"Usuarios",null,null,{"$f":"\"Su entidad gestionó sesiones del comité de conciliación a través del sistema eKOGUI durante el semestre \"&Portada!I6","v":"Su entidad gestionó sesiones del comité de conciliación a través del sistema eKOGUI durante el semestre I - 2025"},{"$nulls":12},"NO"]
[]
[null,"Abogados",null,null,"Su entidad elaboró las fichas de conciliación a través del sistema eKOGUI durante el semestre I - 2025",{"$nulls":12},"NO"]
[]
[null,"Registro Casos"]
[{"$nulls":4},"Fichas para decisión del comité",{"$nulls":14},"Acceder a la guía"]
[null,"Judiciales",{"$nulls":7},"Con fecha",null,"Sin fecha",null,"Total"]
[{"$nulls":4},"Cantidad de procesos  arbitrales para decisión del comité",{"$nulls":4},0,{"$nulls":3},{"$f":"+J15+L15","v":0}]
{"$rows_left_out":11}
{"sheet":"Pagos","index":7,"n_rows":22,"n_cols":21,"rows_kept":22,"merged":[[1,4,2,22],[4,4,5,18],[4,20,11,22],[5,1,5,2],[6,1,6,2],[7,1,7,2],[8,1,8,2],[8,4,9,16],[8,17,9,18],[9,1,9,2],[10,1,10,2],[10,4,11,16],[10,17,11,18],[11,1,11,2],[12,1,12,2],[12,20,13,22],[13,1,13,2],[14,1,14,2],[15,1,15,2],[15,4,15,18],[16,1,16,2],[16,4,20,18],[17,1,17,2],[18,1,18,2],[19,1,19,2],[20,1,20,2],[21,1,21,2]]}
[]
[{"$nulls":4},"Pagos"]
[]
[]
[{"$nulls":4},"En esta sección se presenta la información detallada del módulo de relación de pagos.",{"$nulls":15},"Para saber más sobre cómo completar la hoja de pagos puede consultar la sección (Hoja pagos) de la Guía de Control Interno."]
[null,"Portada"]
[]
[null,"Usuarios"]
[{"$nulls":4},"¿Su entidad gestiona sus trámites financieros en SIIF-MinHacienda?",{"$nulls":12},"NO"]
[null,"Abogados",{"$nulls":17},{"$f":"IF(R9=\"SI\",1,\" \")","v":" "}]
[{"$nulls":4},{"$f":"IFERROR(IF(T10=1,\"¿Cuántos pagos ha relacionado la entidad en ekOGUI?\",IF(T10=_xleta.NOT,\"\")),\"\")","v":""}]
[null,"Registro Casos"]
[{"$nulls":20},"Acceder a la guía"]
[null,"Judiciales"]
[]
{"$rows_left_out":8}
{"sheet":"Resumen","index":8,"n_rows":50,"n_cols":23,"rows_kept":50,"merged":[[1,11,6,13],[2,7,2,8],[3,7,3,8],[5,0,5,1],[5,3,5,8],[6,0,6,1],[6,3,6,8],[7,0,7,1],[7,11,7,13],[8,0,8,1],[9,0,9,1],[9,4,9,8],[10,0,10,1],[10,4,10,8],[11,0,11,1],[12,0,12,1],[12,4,12,8],[13,0,13,1],[14,0,14,1],[14,7,14,8],[15,0,15,1],[15,7,15,8],[16,0,16,1],[16,7,16,8],[17,0,17,1],[17,7,17,8],[18,0,18,1],[18,7,18,8],[19,0,19,1],[19,7,19,8],[20,0,20,1],[21,0,21,1],[21,7,21,8],[25,7,25,8],[27,7,27,8],[34,3,34,8],[35,3,41,8],[42,3,43,8],[44,3,47,8],[49,4,49,6],[50,4,53,6]]}
[]
[{"$nulls":11},"Para saber más sobre el contenido y cómo completar la hoja resumen puede consultar la sección (Hoja resumen) de la Guía de Control Interno."]
[{"$nulls":7},"Fecha de diligenciamiento"]
[{"$nulls":7},"2025-08-26"]
[]
["Portada",null,null,"Agencia Nacional de Defensa Jurídica del Estado"]
[{"$nulls":3},{"$f":"\"Plantilla de Certificado de Control Interno semestre \"&Portada!I6","v":"Plantilla de Certificado de Control Interno semestre I - 2025"}]
["Usuarios",{"$nulls":10},"Acceder a la guía"]
[{"$nulls":9},{"$f":"+VLOOKUP(E10,Administrador!$E$2:$F$338,2,0)","v":0}]
["Abogados",null,null,"Nombre de la Entidad que reporta","CORPORACION AUTONOMA REGIONAL DEL ATLANTICO-CRA"]
[{"$nulls":3},{"$f":"IFERROR(IF(J9=1,\"Digite el nombre de la Entidad\",IF(J9=2,\"Digite el nombre de la Seccional\",\"\")),\"\")","v":""}]
["Registro Casos",{"$nulls":21},"Si"]
[{"$nulls":3},"Nombre del Jefe de Control Interno que reporta","Jose Antonio Cardozo Alvarez",{"$nulls":17},"No"]
["Judiciales",{"$nulls":21},"N/A"]
[{"$nulls":3},"INFORMACIÓN USUARIOS",{"$f":"IF(Usuarios!K11=\"\",\"Falta diligenciar\",IF(Usuarios!K13=\"\",\"Falta diligenciar\",IF(Usuarios!K15=\"\",\"Falta diligenciar\",IF(Usuarios!K17=\"\",\"Falta diligenciar\",IF(Usuarios!K19=\"\",\"Falta diligenciar\",IF(Usuarios!H11=\"\",\"Falta diligenciar\",IF(Usuarios!H13=\"\",\"Falta diligenciar\",IF(Usuarios!H15=\"\",\"Falta diligenciar\",IF(Usuarios!H17=\"\",\"Falta diligenciar\",IF(Usuarios!H19=\"\",\"Falta diligenciar\",IF(Abogados!J9=\"\",\"Falta diligenciar\",IF(Resumen!E19=\"\",\"Falta diligenciar\",IF(Abogados!P19=\"\",\"Falta diligenciar\",IF(Abogados!P21=\"\",\"Falta diligenciar\",IF(Abogados!P23=\"\",\"Falta diligenciar\",\"\")))))))))))))))","v":""},null,"ARBITRAMENTOS",{"$f":"IF(AND(Arbitramentos!L13=\"\", Arbitramentos!U13=\"\"), \"Falta diligenciar\", IF(Arbitramentos!L13=\"\", \"Falta diligenciar\", IF(Arbitramentos!U13=\"\", \"Falta diligenciar\",IF(H17=\"\", \"Falta diligenciar\",\"\"))))","v":""}]
{"$rows_left_out":36}
{"sheet":"Información a consolidar","index":9,"n_rows":4,"n_cols":71,"rows_kept":4,"hidden":true,"merged":[[0,0,0,14],[0,15,0,24],[0,25,0,28],[0,29,0,53],[0,54,0,57],[0,58,0,68],[0,69,0,70],[1,0,1,2],[1,3,1,5],[1,6,1,8],[1,9,1,11],[1,12,1,14],[1,15,1,18],[1,19,1,21],[1,22,1,24],[1,25,1,28],[1,29,1,31],[1,32,1,33],[1,34,1,38],[1,39,1,41],[1,42,1,45],[1,46,1,53],[1,54,1,55],[1,56,1,57],[1,58,1,59],[1,60,1,65],[1,66,1,68],[1,69,1,70]]}
["5.2 Usuarios",{"$nulls":14},"5.3 Abogados",{"$nulls":9},"5.4 Registro Casos ekOGUI",{"$nulls":3},"5.5 Judiciales",{"$nulls":24},"5.6 Arbitramentos",{"$nulls":3},"5.7 Comité de Conciliación ",{"$nulls":10},"5.8 Pagos"]
["Financiero",null,null,"Juridico",null,null,"Control interno",null,null,"Secretario",null,null,"Administrador",null,null,"Información",{"$nulls":3},"Completitud",null,null,"Capacitación",null,null,"Información",{"$nulls":3},"Activos",null,null,"Terminados",null,"Condenas",{"$nulls":4},"Mayores a 33.000 SMMLV",null,null,"Calificación del Riesgo",{"$nulls":3},"Provisión Contable",{"$nulls":7},"Activos",null,"Terminados",null,"Preguntas generales",null,"Fichas para decisión del comité",{"$nulls":5},"Fichas con decisión del comité",null,null,"Información"]
["Creación","Nombre","Capacitación","Creación","Nombre","Capacitación","Creación","Nombre","Capacitación","Creación","Nombre","Capacitación","Creación","Nombre","Capacitación","Cantidad de abogados litigando según jurídica","Abogados activos en ekOGUI","Retirados de la entidad según jurídica primer semestre","Inactivados en ekOGUI durante el primer semestre","De la muestra, cuantos tienen el nombre correcto","De la muestra cuantos tienen el correo electrónico de prueba correcto","De la muestra, cuantos tienen tipo de vinculación de planta","Su última capacitación fue realizada después del 01-01-2024 hasta el 30-06-2025","Su última capacitación fue anterior al 31-12-2023","No tienen capacitación","Cuántos casos (procesos arbitrales, procesos judiciales y conciliaciones extrajudiciales) fueron notificados por el buzón notificaciones judiciales a la Entidad durante el primer semestre","Cuántos de los casos notificados fueron registrados en el sistema ekOGUI durante el semestre I - 2025","De acuerdo con la pregunta anterior, cuántos casos fueron registrados con oportunidad (10 días hábiles) en el sistema ekOGUI,  conforme a la normativa (No. 3 art. 2.2.3.4.1.10 DL 104 de 2025) en el semestre I - 2025","Total de casos NO registrados en el sistema ekOGUI con oportunidad (10 días hábiles) conforme a la normativa (No. 3 art. 2.2.3.4.1.10 DL 104 de 2025) en el semestre I - 2025","Cantidad de procesos activos según jurídica","Procesos activos registrados en eKOGUI","Procesos sin abogado asignado","Procesos terminados durante el primer semestre según juridica","Procesos terminados durante el primer semestre en ekOGUI","Procesos analizados","Procesos terminados con ejecutoria","Procesos desfavorables","Procesos que generan erogación económica","Procesos con valor condena mayor a cero","Cantidad de procesos de más de 33.000 SMMLV según jurídica","Cantidad de procesos de más de 33.000 SMMLV registrados en ekOGUI","Cantidad de procesos más de 33.000 SMMLV con la pieza demanda","Cantidad de procesos activos ekOGUI - Calidad demandado","Cantidad de procesos en ekOGUI - Calificación durante o posterior al primer semestre","Cantidad de procesos en ekOGUI - Calificación anterior al primer semestre ","Cantidad de procesos en ekOGUI - Sin calificación","Alta","Alta cero","Media","Media cero","Baja","Baja cero","Remota","Remota cero","Arbitramentos activos al 30-06-2025 según jurídica","Arbitramentos activos registrados en ekOGUI al 30-06-2025","Total arbitramentos terminados según  juridica al 30-06-2025","Total arbitramentos terminados en ekOGUI al 30-06-2025","Su entidad gestionó sesiones del comité en el primer semestre de 2025","Su entidad elaboró las fichas de conciliación  durante el primer semestre","Arbitrales con fecha","Arbitrales sin fecha","Judiciales con fecha","Judiciales sin fecha","Conciliaciones  con fecha","Conciliaciones  sin fecha","Total arbitrales","Total judiciales","Total conciliaciones","Su entidad gestiona en SIIF-Minhacienda","Cuántos pagos ha relacionado la entidad en ekOGUI"]
[{"$f":"+Usuarios!$H$11","v":"2021-03-18"},{"$f":"+Usuarios!$K$11","v":"Tayro Alberto Pimienta Deluque"},{"$f":"+Usuarios!$O$11","v":"2025-01-22"},{"$f":"+Usuarios!$H$13","v":"2023-06-07"},{"$f":"+Usuarios!$K$13","v":"Paola Fontalvo Lopez"},{"$f":"+Usuarios!$O$13","v":"2025-01-22"},{"$f":"+Usuarios!$H$15","v":"2015-04-03"},{"$f":"+Usuarios!$K$15","v":"Jose Antonio Cardozo Alvarez"},{"$f":"+Usuarios!$O$15","v":"2025-01-22"},{"$f":"+Usuarios!$H$17","v":"2024-04-05"},{"$f":"+Usuarios!$K$17","v":"Jorge Paez Barros"},{"$f":"+Usuarios!$O$17","v":"2025-01-22"},{"$f":"+Usuarios!$H$19","v":"2024-12-11"},{"$f":"+Usuarios!$K$19","v":"María Luisa Mercado Cepeda"},{"$f":"+Usuarios!$O$19","v":"2025-01-22"},{"$f":"+Abogados!$G$9","v":8},{"$f":"+Abogados!$J$9","v":8},{"$f":"+Abogados!$M$9","v":1},{"$f":"+Abogados!$P$9","v":1},{"$f":"+Abogados!$I$19","v":8},{"$f":"+Abogados!$I$21","v":8},{"$f":"+Abogados!I23","v":1},{"$f":"+Abogados!$P$19","v":5},{"$f":"+Abogados!$P$21","v":0},{"$f":"+Abogados!$P$23","v":3},{"$f":"+'Registro Casos'!$P$10","v":2},{"$f":"+'Registro Casos'!$P$13","v":2},{"$f":"+'Registro Casos'!$P$16","v":1},{"$f":"+'Registro Casos'!$P$19","v":1},{"$f":"+Judiciales!$L$12","v":101},{"$f":"+Judiciales!$L$14","v":93},{"$f":"+Judiciales!$L$16","v":0},{"$f":"+Judiciales!$L$21","v":75},{"$f":"+Judiciales!$L$23","v":150},{"$f":"+Judiciales!$L$32","v":37},{"$f":"+Judiciales!$L$34","v":37},{"$f":"+Judiciales!$L$36","v":0},{"$f":"+Judiciales!$L$38","v":0},{"$f":"+Judiciales!$L$40","v":0},{"$f":"+Judiciales!$U$12","v":3},{"$f":"+Judiciales!$U$14","v":3},{"$f":"+Judiciales!$U$16","v":3},{"$f":"+Judiciales!$U$21","v":86},{"$f":"+Judiciales!$U$23","v":64},{"$f":"+Judiciales!$U$25","v":10},{"$f":"+Judiciales!$U$27","v":12},{"$f":"+Judiciales!$S$32","v":0},{"$f":"+Judiciales!$T$32","v":2},{"$f":"+Judiciales!$S$34","v":0},{"$f":"+Judiciales!$T$34","v":5},{"$f":"+Judiciales!$S$36","v":0},{"$f":"+Judiciales!$T$36","v":1},{"$f":"+Judiciales!$S$38","v":0},{"$f":"+Judiciales!$T$38","v":66},{"$f":"+Arbitramentos!$L$11","v":0},{"$f":"+Arbitramentos!$L$13","v":0},{"$f":"+Arbitramentos!$U$11","v":0},{"$f":"+Arbitramentos!$U$13","v":0},{"$f":"+'Comité de conciliación'!$R$8","v":"NO"},{"$f":"+'Comité de conciliación'!$R$10","v":"NO"},{"$f":"+'Comité de conciliación'!$J$15","v":0},{"$f":"+'Comité de conciliación'!$L$15","v":0},{"$f":"+'Comité de conciliación'!$J$16","v":0},{"$f":"+'Comité de conciliación'!$L$16","v":0},{"$f":"+'Comité de conciliación'!$J$17","v":1},{"$f":"+'Comité de conciliación'!$L$17","v":0},{"$f":"+'Comité de conciliación'!$J$20","v":0},{"$f":"+'Comité de conciliación'!$J$21","v":0},{"$f":"+'Comité de conciliación'!$J$22","v":1},{"$f":"+Pagos!$R$9","v":"NO"},{"$f":"+Pagos!R11","v":0}]

{"sheet":"Administrador","index":10,"n_rows":426,"n_cols":11,"rows_kept":426,"hidden":true,"merged":[[6,0,6,2],[7,0,7,2]]}
["SEMESTRE",null,"OPCIONES","1er","Entidad"]
["¿Actual?",{"$f":"+Portada!I6","v":"I - 2025"},null,"2do","ADMINISTRADORA COLOMBIANA DE PENSIONES-COLPENSIONES",0,null,"II - 2024","SEGUNDO",2024,"31 DE DICIEMBRE "]
[null,{"$f":"+VLOOKUP(B2,$H$2:$J$6,2,0)","v":"PRIMER"},null,null,"ADMINISTRADORA DE LOS RECURSOS DEL SISTEMA GENERAL DE SEGURIDAD SOCIAL EN SALUD-ADRES",0,null,"I - 2025","PRIMER",2025,"30 DE JUNIO "]
[null,{"$f":"+VLOOKUP(B2,$H$2:$J$6,3,0)","v":2025},null,null,"ADMINISTRADORA DEL MONOPOLIO RENTISTICO DE LOS JUEGOS DE SUERTE Y AZAR-COLJUEGOS",0,null,"II - 2025","SEGUNDO",2025,"31 DE DICIEMBRE "]
[null,{"$f":"+VLOOKUP(B2,$H$2:$K$6,4,0)","v":"30 DE JUNIO "},null,null,"AGENCIA COLOMBIANA PARA LA REINCORPORACION Y NORMALIZACION-ANR",0,null,"I - 2026","PRIMER",2026,"30 DE JUNIO "]
[{"$nulls":4},"AGENCIA DE DESARROLLO RURAL-ADR",0,null,"II - 2026","SEGUNDO",2026,"31 DE DICIEMBRE "]
["Año en curso",{"$nulls":3},"AGENCIA DE RENOVACION DEL TERRITORIO-ART",0]
[2025,{"$nulls":3},"AGENCIA DEL INSPECTOR GENERAL DE TRIBUTOS, RENTAS Y CONTRIBUCIONES PARAFISCALES-ITRC",0]
[{"$nulls":4},"AGENCIA LOGISTICA DE LAS FUERZAS MILITARES-ALFM",0,null,"2010-01-01",0]
[{"$nulls":4},"AGENCIA NACIONAL DE CONTRATACION PUBLICA - COLOMBIA COMPRA EFICIENTE-CCE",0,null,"2020-01-01",1]
[{"$nulls":4},"AGENCIA NACIONAL DE DEFENSA JURIDICA DEL ESTADO-ANDJE",0,null,"2024-01-01",2]
["¿Uso de módulo de pagos?",null,"OPCIONES","SI","AGENCIA NACIONAL DE HIDROCARBUROS-ANH",0]
["Respuesta",{"$f":"Pagos!R9","v":"NO"},null,"NO","AGENCIA NACIONAL DE INFRAESTRUCTURA-ANI",0]
[{"$nulls":4},"AGENCIA NACIONAL DE MINERIA-ANM",0]
[{"$nulls":4},"AGENCIA NACIONAL DE SEGURIDAD VIAL-ANSV",0]
{"$rows_left_out":412}
{"sheet":"Entidades","index":11,"n_rows":427,"n_cols":1,"rows_kept":427,"hidden":true}
["Entidad"]
["ADMINISTRADORA COLOMBIANA DE PENSIONES-COLPENSIONES"]
["ADMINISTRADORA DE LOS RECURSOS DEL SISTEMA GENERAL DE SEGURIDAD SOCIAL EN SALUD-ADRES"]
["ADMINISTRADORA DEL MONOPOLIO RENTISTICO DE LOS JUEGOS DE SUERTE Y AZAR-COLJUEGOS"]
["AGENCIA COLOMBIANA PARA LA REINCORPORACION Y NORMALIZACION-ANR"]
["AGENCIA DE DESARROLLO RURAL-ADR"]
["AGENCIA DE RENOVACION DEL TERRITORIO-ART"]
["AGENCIA DEL INSPECTOR GENERAL DE TRIBUTOS, RENTAS Y CONTRIBUCIONES PARAFISCALES-ITRC"]
["AGENCIA LOGISTICA DE LAS FUERZAS MILITARES-ALFM"]
["AGENCIA NACIONAL DE CONTRATACION PUBLICA - COLOMBIA COMPRA EFICIENTE-CCE"]
["AGENCIA NACIONAL DE DEFENSA JURIDICA DEL ESTADO-ANDJE"]
["AGENCIA NACIONAL DE HIDROCARBUROS-ANH"]
["AGENCIA NACIONAL DE INFRAESTRUCTURA-ANI"]
["AGENCIA NACIONAL DE MINERIA-ANM"]
["AGENCIA NACIONAL DE SEGURIDAD VIAL-ANSV"]
{"$rows_left_out":412}